{"text_format":"1","workbook":"xlsx","n_sheets":12,"sheets":["READ_ME_FIRST","Main","Combo Results","Eng Mod","Cases","Cases_def","PL Pressure Relation","Cost Indices","Pipe Cap","Pipe Cap plot","Parameters","Version"],"not_rendered":{"charts":25,"images":3,"macros":1,"external_links":2,"defined_names":154,"comments":0,"pivot_tables":0},"unopened":[],"bounds":{"document_bytes":16777216,"sheet_cells":100000,"rows_first":2000,"rows_last":500,"rows_between":2000,"halvings":0,"cell_chars":16384,"cell_head_chars":4096},"cells_cut":0,"cells_raw":0,"read":"whole","date_system":"1900"}

{"sheet":"READ_ME_FIRST","index":0,"n_rows":64,"n_cols":14,"rows_kept":64,"cut":false,"hidden":false,"merged":[[21,1,21,13],[6,1,6,2],[9,1,9,6],[10,1,10,6],[20,1,20,13],[23,1,23,13],[25,1,25,13],[27,1,27,13],[29,1,29,2],[30,1,30,2],[30,3,30,6],[30,8,30,9],[30,10,30,13],[32,8,32,11],[32,12,32,13],[32,1,32,6],[31,1,31,6],[31,8,31,11],[31,12,31,13],[37,8,37,13],[40,2,40,6],[40,9,40,13],[35,2,35,6],[35,9,35,13],[36,2,36,6],[36,9,36,13],[39,1,39,6],[38,2,38,6],[41,8,41,13],[63,2,63,13],[62,2,62,13],[60,2,60,13],[61,2,61,13],[46,2,46,6],[53,1,53,6],[52,2,52,6],[47,1,47,6],[48,2,48,6],[50,2,50,6],[49,1,49,6],[51,1,51,6],[44,2,44,6],[45,1,45,6],[42,2,42,6],[54,2,54,6],[55,1,55,6],[56,2,56,6],[57,1,57,6],[33,1,33,6],[41,1,41,6],[37,1,37,6],[43,1,43,6]]}
[]
[]
[]
[]
[]
[null,"Version",null,null,null,null,null,null,null,null,null,"Date:",null,{"$f":"LOOKUP(2,1/(Version!C:C<>\"\"),Version!C:C)","v":"2022-03-14"}]
[null,{"$f":"LOOKUP(2,1/(Version!A:A<>\"\"),Version!A:A)","v":"3"},null,null,null,null,null,null,null,null,null,"Publication number:",null,"DOE/NETL-2022/3243"]
[null,null,null,null,null,null,null,null,null,null,null,"Status:",null,{"$f":"LOOKUP(2,1/(Version!B:B<>\"\"),Version!B:B)","v":"Final"}]
[]
[null,"The 2022 version of the FECM/NETL CO2 Transport Cost Model (CO2_T_COM) estimates costs for transporting liquid CO2 in a pipeline from a source, such as a power plant, to either a CO2 saline storage site or a CO2 EOR site. This is a point-to-point transport model and does not account for possible cost reductions from using a larger diameter trunkline as part of a pipeline network. The model includes costs for constructing and operating the pipeline, including booster pumps if desired. To use the model, change any of the inputs, which are always orange cells, to the values appropriate for your project."]
{"$rows_left_out":55}
{"sheet":"Main","index":1,"n_rows":223,"n_cols":104,"rows_kept":223,"cut":false,"hidden":false,"merged":[[8,1,9,2],[183,2,185,2],[207,2,209,2],[48,6,48,13],[45,6,45,13],[112,2,114,2],[104,2,106,2]]}
[null,"This sheet is the core interface of the model, houses the financial module, provides a number of key inputs (orange cells) the user can modify, and summarizes key results"]
[]
[]
[]
[]
[]
[null,"Table 1","Summary","A. Key Inputs and Results for Basic Analysis",null,null,null,null,null,"B. First-Year Break-Even Price of CO2 as a Function of Number of Pumps",null,null,null,null,null,null,"C. First-Year Break-Even Price of CO2 as a Function of Length of Pipeline",null,null,null,null,null,null,null,"D. First Year Break-Even Price of CO2 as a Function of the Transport Rate"]
[null,null,null,null,{"$f":"E59&\"$/tonne\"","v":"2011$/tonne"},{"$f":"E60&\"$/tonne\"","v":"2018$/tonne"},{"$f":"(E60+E61)&\"$/tonne\"","v":"2021$/tonne"},null,null,"Enter a blank cell in column J to indicate the end of input values",null,null,null,null,null,null,"Enter a blank cell in column Q to indicate the end of input values",null,null,null,null,null,null,null,"Enter a blank cell in column Y to indicate the end of input values"]
[null,"SUMMARY",null,null,null,"first yr of proj","first yr of transp",null,null,"Num. of pumps","First Year Price","First Year Price","First Year Price","Minimum Inner","Selected Nominal",null,"Length of ","First Year Price","First Year Price","First Year Price","Optimal","Minimum Inner","Selected Nominal",null,"Annual Average","First Year Price","First Year Price","First Year Price","Optimal","Minimum Inner","Selected Nominal"]
[null,null,null,"First-year Price to Transport CO2 by Pipeline",1.9,{"$f":"ROUND(E10*E50,2)","v":2.21},{"$f":"ROUND(F10*(1+E51)^E61,2)","v":2.37},".",null,"where results are","base year",{"$f":"F9","v":"first yr of proj"},{"$f":"G9","v":"first yr of transp"},"Pipe Diameter","Pipe Diameter",null,"pipeline","base year",{"$f":"F9","v":"first yr of proj"},{"$f":"G9","v":"first yr of transp"},"Number of","Pipe Diameter","Pipe Diameter",null,"CO2 Mass Flow ","base year",{"$f":"F9","v":"first yr of proj"},{"$f":"G9","v":"first yr of transp"},"Number of","Pipe Diameter","Pipe Diameter"]
{"$rows_left_out":214}
{"sheet":"Combo Results","index":2,"n_rows":40,"n_cols":23,"rows_kept":40,"cut":false,"hidden":false,"merged":[[1,9,3,9],[1,0,2,0],[1,1,2,1],[1,2,2,2]]}
["E. First Year Break-Even Price of CO2 Based on Three Input Variables",null,null,null,null,"Enter a blank cell in column A to indicate the end of inputs"]
["Annual Average CO2 Mass Flow Rate","Pipeline Length","Elevation Change","First Year Price","First Year Price","First Year Price","Optimal","Minimum Inner","Selected Nominal","Note"]
[null,null,null,"base year",{"$f":"Main!F9","v":"first yr of proj"},{"$f":"Main!G9","v":"first yr of transp"},"Number of Pumps","Pipe Diameter","Pipe Diameter"]
["Mtonnes/yr","mi","ft",{"$f":"Main!E8","v":"2011$/tonne"},{"$f":"Main!F8","v":"2018$/tonne"},{"$f":"Main!G8","v":"2021$/tonne"},"Pumps","in","in"]
[4.3,50,0]
[4.3,100,0]
[4.3,200,0]
[4.3,300,0]
[4.3,500,0]
[]
{"$rows_left_out":31}
{"sheet":"Eng Mod","index":3,"n_rows":185,"n_cols":14,"rows_kept":185,"cut":false,"hidden":false,"merged":[[66,13,66,14],[2,8,2,10],[2,6,2,7],[37,3,37,4],[37,6,37,7],[37,8,37,10],[2,3,2,4],[55,3,55,4],[55,6,55,7],[55,8,55,10],[183,1,183,10],[184,1,184,10],[68,3,68,4],[68,6,68,7],[68,8,68,10],[175,1,175,10],[170,1,170,10],[169,1,169,10],[168,1,168,10],[172,1,172,10],[174,1,174,10],[179,1,179,10],[180,1,180,10],[139,3,139,4],[139,6,139,7],[139,8,139,10],[122,3,122,4],[122,6,122,7],[122,8,122,10],[181,1,181,10],[182,1,182,10],[177,1,177,10],[173,1,173,10],[176,1,176,10],[171,1,171,10]]}
[null,"This sheet contains the engineering module, which includes engineering equations and capital and operating expenses, provides a number of inputs (orange cells) the user can modify, and summarizes results"]
[]
[null,null,null,"Variable Value in Primary Units",null,"Factor","Values in Alternate Units",null,"Typical Range of Inputs"]
[null,"Variable","Variable Symbol","Value","units",null,"Value","units","Min","Max","units",null,"Equations","Comments"]
[null,"1. Engineering Calculations"]
[null,"1.1. General Characteristics"]
[null,"Temperature of ground","TPipeline",53,"°F",null,{"$f":"T_Conv(D7, E7, \"K\")","v":284.81666666666666},"K",40,60,"°F"]
[]
[null,"1.2. Pipeline Characteristics"]
[null,"Length","LPL",{"$f":"Main!E74","v":62},{"$f":"Main!F74","v":"mi"},null,{"$f":"l_conv(D10,E10,\"m\")","v":99779.328000000009},"m",null,null,null,null,null,"See sheet \"Main\""]
{"$rows_left_out":176}
{"sheet":"Cases","index":4,"n_rows":149,"n_cols":108,"rows_kept":149,"cut":false,"hidden":false,"merged":[[14,0,14,8],[13,0,13,8],[1,0,1,8],[12,0,12,8],[2,0,2,8],[3,0,3,8],[11,0,11,8],[4,0,4,8],[5,0,5,8],[8,0,8,8],[6,0,6,8],[9,0,9,8],[7,0,7,8],[10,0,10,8]]}
["This sheet provides the inputs for running the \"Process_Cases\" macro and presents results or outputs for each case"]
["Overview of the Process_Cases macro"]
["This macro allows the user to process different cases, where a case specifies:\n - Pipeline length, \n - Maximum CO2 mass flow rate, \n - Capacity factor, and\n - Elevation difference from the inlet to the outlet of the pipeline."]
["The user can specify the variables to save for each case in the row labeled \"Formulas\" in Column A.  \nA formula that calculates the variable or provides a reference to the variable needs to be provided in one of the light purple cells in the \"Formulas\" row starting with Column I. \nA label for the variable and its units should be specified starting in the fourth row below the cell in the \"Formulas\" row."]
["The user can specify variables in the \"Formulas\" row from Column I to Column DD."]
["The user specifies the cases starting in the row labeled \"Start\" in Column A.\nA case is specified by providing the following information:\n - Case number in Column B. Typically the case number begins with 1 and increments by 1 for each new case (each row). However, any non-blank number or text can be input as the case number. The cell in this column after the last case needs to be blank to indicate to the macro that no more cases are to be evaluated. See the Note below.\n - Pipeline length in Column C in miles"]
[" - Maximum CO2 mass flow rate in Column D in Mtonnes/year. This is the instantaneous maximum CO2 mass flow rate the pipeline needs to be able to sustain expressed on an annualized basis.\n - Capacity factor in Column E. The capacity factor multiplied by the maximum CO2 mass flow rate gives the average annual CO2 mass flow rate which is calculated and presented in Column F. Alternatively, the user can specify the average annual CO2 mass flow rate and calculate the maximum CO2 mass flow rate.\n - Elevation difference from the inlet to the outlet of the pipeline in Column G. If the elevation increases from the inlet to the outlet then the elevation difference is positive; if the elevation decreases from the inlet to the outlet, the elevation difference is negative."]
["Note: The case number in Column B is provided to help the user uniquely identify a case. The case number can be any alpha-numeric value. The macro reads the contents of the cell in Column B, and if the cell is blank, the macro stops processing cases and completes its execution. If the contents of this cell are not blank (i.e., if it contains anything else, such as a number or a letter or any combination of numbers, letters, or special characters), the macro assumes this row is a case the user wishes to process. However, the macro does not use the case number in any calculations."]
["The macro works by evaluating cases starting with the first case in the row labeled \"Start\". For each case, the following procedure is used.\n - In the case row, the macro copies the contents in Columns C through G and then pastes the contents as values in the same columns in the \"Formulas\" row.  \n - The macro copies the values in Columns C through G in the \"Formulas\" row into VBA variables and pastes the values of the variables in appropriate cells in the \"Main\" sheet.\n - Based on the new inputs, the macro does a variety of calculations with VBA (i.e., calls VBA subroutines or functions) to provide new results in various places in the spreadsheet including the formulas in the \"Formulas\" row."]
["- The macro copies the contents of Columns I through DD in the \"Formulas\" row and pastes the contents in Columns I through DD in the case row first as values and then with the cell formats. Columns I through DD provide the user with up to 100 output variables.\nThe macro begins this procedure at the \"Start\" row, and then processes all subsequent rows until the cell in Column B of a row is blank. \nThe macro then stops and displays a message indicating the macro has finished."]
{"$rows_left_out":140}
{"sheet":"Cases_def","index":5,"n_rows":50,"n_cols":5,"rows_kept":50,"cut":false,"hidden":false,"merged":[]}
["This sheets provides definitions of some of the variables in the \"Cases\" sheet that are either user inputs or outputs calculated with the \"Process_Cases\" macro"]
["This sheet is for the user to use or ignore as they see fit"]
["If the user adds or deletes output variables in the \"Cases\" sheet, the user needs to add or delete rows in this sheet defining these variables if the user wants to keep this sheet up to date"]
["However, if this sheet is not consistent with the output variables in the \"Cases\" sheet, it will not affect the performance of the \"Process_Cases\" macro"]
["The user can provide formulas for up to 100 output variables in the \"Cases\" sheet"]
[]
["Column Label","Variable","Units","Description","Additional Comments"]
[null,"Inputs"]
["A","Case number",null,"Number of the case which is a specific pipe length, maximum CO2 mass flow rate, and capacity factor (used to generate annual maximum CO2 mass flow rate)"]
["B","Pipeline length","mi","Length of pipeline including tortuosity"]
{"$rows_left_out":41}
{"sheet":"PL Pressure Relation","index":6,"n_rows":64,"n_cols":25,"rows_kept":64,"cut":false,"hidden":false,"merged":[[9,1,10,1],[2,1,2,9],[3,1,3,9],[9,15,9,16],[9,11,10,11],[9,12,10,12],[9,13,10,13],[9,14,10,14],[8,11,8,16],[8,4,8,9],[9,8,9,9],[9,2,10,2],[9,3,10,3],[9,4,10,4],[9,5,10,5],[62,14,62,22],[63,14,63,22],[9,6,10,6],[9,7,10,7],[9,17,9,18],[60,14,60,22],[61,14,61,22],[8,19,10,19]]}
[null,"This sheet includes data for developing a factor to translate natural gas pipeline capital costs to CO2 pipeline capital costs "]
[]
[null,"See ICF International (2009) listed in \"Eng Mod\" sheet for more information"]
[null,"With regards to pressure differences between natural gas (NG) and CO2 pipelines, this report identifies that the material and labor costs for the CO2 pipelines will be greater due to the higher pressures.  To contain the pressure, the wall thickness is increased which increases the materials costs.  The labor costs will increase due to the moving of heavier pipe and welding of thicker pipe.  This report summarizes the cost increase based on wall thickness and pipe size and the additional costs.  Note, these costs are limited to steel only.  Further, for pipe sizes less than 12 inches, there is no increase in the material costs; for pipe sizes greater than 24 inches, the material cost increase from NG to CO2 is 25%. This corresponds to a roughly 25% increase in the wall thickness.\n\nFrom discussions with the cost estimators at WorleyParsons, pipe is not costed on a per pound basis.  However, based on limited experience with projects considering pipelines and different wall thickness, the correlations appear to be correct.  Based on these findings, the pipeline material and labor costs are adjusted using the following rule sizes:  <12\", no adjustment; 16\", 1.12 factor applied; > 24\", 1.25 applied.  20\" pipe is not covered in this table, an average between the 16\" and 24\" size is assumed, 1.18.\n\nAdjustment is determined using function Pres_Fact(PL_d).  Function returns the factor, as described above, for pipe inner diameter PL_d."]
[]
[null,"Table A: Data from ICF International (2009)"]
[null,"Derivation of factors:"]
[null,"From Table 2-10 CO2 and Natural Gas Designs and Steel Requirements"]
[null,null,null,null,"Natural Gas",null,null,null,null,null,null,"CO2",null,null,null,null,null,null,null,"Results from function Pres_Fact( inner_dia )"]
[null,"Pipe OD (in)","Maximum Stress","Class Coeff.","Maximum Pressure","Wall Thickness (in)","Inside Diameter (in)","Tons/mile","Steel Costs $/mile cost",null,null,"Maximum Pressure","Wall Thickness (in)","Inside Diameter (in)","Tons/mile","Steel Costs $/mile cost",null,"Cost Ratios (CO2/NG)"]
{"$rows_left_out":55}
{"sheet":"Cost Indices","index":7,"n_rows":63,"n_cols":14,"rows_kept":63,"cut":false,"hidden":false,"merged":[[6,0,6,13]]}
["This sheet provides indices for adjusting costs and prices from a basis in one year to another year"]
[]
["Series Id:  PCU213112213112     ftp://ftp.bls.gov/pub/time.series/pc/pc.data.3.MiningSupport"]
["Industry:   Support activities for oil and gas operations"]
["Product:    Support activities for oil and gas operations"]
["Base Date:  8512"]
["U.S. Bureau of Labor Statistics Producer Price Index"]
["Year","Jan","Feb","Mar","Apr","May","Jun","Jul","Aug","Sep","Oct","Nov","Dec","Annual"]
[1997,111.7,112.2,112.2,111.9,112.4,112.5,112.7,112.8,113.1,113.4,113.6,113.7,112.7]
[1998,114,113.9,113.9,114,114.1,113.9,114,113.9,113.8,113.1,112.6,112.5,113.6]
{"$rows_left_out":54}
{"sheet":"Pipe Cap","index":8,"n_rows":107,"n_cols":51,"rows_kept":107,"cut":false,"hidden":false,"merged":[]}
["This sheet has natural gas pipeline capital costs for different equations"]
[]
["signif. figs. =",3,null,null,null,null,null,null,null,null,null,null,null,null,null,null,null,"signif. figs. =",{"$f":"B3","v":3},null,null,null,null,null,null,null,null,null,null,null,null,null,null,null,"signif. figs. =",{"$f":"B3","v":3}]
["Region =",{"$f":"Main!$E$83","v":"MW"},null,null,null,null,null,null,null,null,null,null,null,null,null,null,null,"Region =",{"$f":"B4","v":"MW"},null,null,null,null,null,null,null,null,null,null,null,null,null,null,null,"Region =",{"$f":"B4","v":"MW"}]
["ConYr =",2011,null,null,null,null,null,null,null,null,null,null,null,null,null,null,null,"ConYr =",{"$f":"IF(B5=2011,2011,2008)","v":2011},null,null,null,null,null,null,null,null,null,null,null,null,null,null,null,"ConYr =",{"$f":"IF(B5=2011,2011,2004)","v":2011}]
[]
["Natural Gas Pipeline Capital Costs per mile Using Parker's Equations (in 2000 or 2011 dollars [see ConYr]/mile)",null,null,null,null,null,null,null,null,null,null,null,null,null,null,null,null,"Natural Gas Pipeline Capital Costs per mile Using Rui et al.'s Equations (in 2008 or 2011 dollars [see ConYr]/mile)",null,null,null,null,null,null,null,null,null,null,null,null,null,null,null,null,"Natural Gas Pipeline Capital Costs per mile Using McCoy and Rubin's Equations (in 2004 or 2011 dollars [see ConYr]/mile)",null,null,null,null,null,null,null,null,null,null,null,null,null,null,null,"Do Not Delete This Table!!!!"]
["Category =","Tot",null,null,null,null,null,null,null,null,null,null,null,null,null,null,null,"Category =","Tot",null,null,null,null,null,null,null,null,null,null,null,null,null,null,null,"Category =","Tot",null,null,null,null,null,null,null,null,null,null,null,null,null,null,"Year for pipeline capital cost"]
["Diameter (in)","Length (mi)",null,null,null,null,null,null,null,null,null,null,null,null,null,null,null,"Diameter (in)","Length (mi)",null,null,null,null,null,null,null,null,null,null,null,null,null,null,null,"Diameter (in)","Length (mi)",null,null,null,null,null,null,null,null,null,null,null,null,null,null,2011]
[null,10,25,50,62.1,100,200,300,400,500,750,1000,1500,2000,null,null,null,null,10,25,50,62.1,100,200,300,400,500,750,1000,1500,2000,null,null,null,null,10,25,50,62.1,100,200,300,400,500,750,1000,1500,2000,null,null,2000]
{"$rows_left_out":98}
{"sheet":"Pipe Cap plot","index":9,"n_rows":207,"n_cols":20,"rows_kept":207,"cut":false,"hidden":false,"merged":[]}
["This sheet contains natural gas pipeline capital costs for different equations with a variety of graphics"]
[]
["signif. figs. =",3,null,null,null,null,null,"signif. figs. =",{"$f":"B3","v":3},null,null,null,null,null,"signif. figs. =",{"$f":"B3","v":3}]
["Region =",{"$f":"Main!$E$83","v":"MW"},null,null,null,null,null,"Region =",{"$f":"B4","v":"MW"},null,null,null,null,null,"Region =",{"$f":"B4","v":"MW"}]
["ConYr =",2011,null,null,null,null,null,"ConYr =",{"$f":"IF(B5=2011,2011,2004)","v":2011},null,null,null,null,null,"ConYr =",{"$f":"IF(B5=2011,2011,2008)","v":2011}]
[]
["Natural Gas Pipeline Capital Costs per mile Using Parker's Equations",null,null,null,null,null,null,"Natural Gas Pipeline Capital Costs per mile Using McCoy and Rubin's Equations",null,null,null,null,null,null,"Natural Gas Pipeline Capital Costs per mile Using Rui et al.'s Equations "]
["Category ","Tot",{"$f":"IF(B$5=2011,\"  Costs in 2011 dollars/mi\",\"  Costs in 2000 dollars/mi\")","v":"  Costs in 2011 dollars/mi"},null,null,null,null,"Category ",{"$f":"B8","v":"Tot"},{"$f":"IF(I$5=2011,\"  Costs in 2011 dollars/mi\",\"  Costs in 2004 dollars/mi\")","v":"  Costs in 2011 dollars/mi"},null,null,null,null,"Category ",{"$f":"B8","v":"Tot"},{"$f":"IF(P$5=2011,\"  Costs in 2011 dollars/mi\",\"  Costs in 2008 dollars/mi\")","v":"  Costs in 2011 dollars/mi"}]
["Diameter (in)","Length (mi)",null,null,null,null,null,"Diameter (in)","Length (mi)",null,null,null,null,null,"Diameter (in)","Length (mi)"]
[null,50,100,200,300,500,null,null,50,100,200,300,500,null,null,50,100,200,300,500]
{"$rows_left_out":198}
{"sheet":"Parameters","index":10,"n_rows":9,"n_cols":15,"rows_kept":9,"cut":false,"hidden":true,"merged":[]}
["Do Not Delete These Tables!!!!",null,null,null,"Do Not Delete This Table!!!!",null,"Do Not Delete This Table!!!!"]
["Units Available for Different Variables",null,null,null,"Categories for Regions of US or Canada",null,"Equations for Natural Gas CAPEX",null,null,null,null,"Parameter","Value"]
["Length","Pressure","Diameter","Temperature","NE","Northeast","PARKER","Parker (2004)",null,null,null,"Macro Option","Combo"]
["mi","psig","in","°F","SE","Southeast","MCCOY","McCoy and Rubin (2009)",null,null,null,"Optimal Pump Number",true]
["km","psia","m","°C","MW","Midwest","RUI","Rui et al. (2011)"]
["m","Pa",null,null,"Cen","Central",null,null,null,null,null,null,"Elevation Delta (ft)","Mountain","Background"]
["ft","MPa",null,null,"SW","Southwest",null,null,null,null,null,"INLET",0,{"$f":"IF(M8<0, M8, 0)","v":0},0]
[null,null,null,null,"West","West",null,null,null,null,null,"OUTLET",{"$f":"Main!E16","v":0},{"$f":"IF(M8<0, 0, M8)","v":0},{"$f":"IF(M8<0, M8, 0)","v":0}]
[null,null,null,null,"Can","Canada"]

{"sheet":"Version","index":11,"n_rows":36,"n_cols":5,"rows_kept":36,"cut":false,"hidden":true,"merged":[]}
["Version","Status","Date","Developer","Description"]
[" ---","Final"," ---","Tim Grant, Dave Morgan","The initial version of the cost model"]
[1,"Final","2014-07-11","Andrea Poe","Modifications by ESPA, released in 2014 as the public version"]
["1_ParkerUpdate","Intermediate","2016-06-30","Chung Shih, Laura Demetrion","Corrected Parker equation coefficient in Macro modNGPipeCapCost"]
["1_ParkerUpdate_4&6inch","Intermediate","2017-08-28","Shangmin Lin","Edited Macro modEng_Calcs to add 4- and 6-inch pipeline sizes"]
["2_int","Final","2018-02-27","Allison Guinan, Shangmin Lin","Reformatted READ_ME_FIRST sheet, changed view of all sheets to Normal, corrected spelling errors and adjusted format throughout, incorporated overview/instruction sections at top of each sheet, deleted note and cell color conventions from Main and Eng Mod sheets, incorporated data validation in Main sheet for duration of construction, edited equations and titles and removed drop-down boxes in Eng Mod sheet, incorporated equations for CO2 requirements in PL Pressure Relations sheet, added y-axis title to charts in Pipe Cap plot1 sheet, removed power line and equation from charts in Pipe Cap plot1 sheet, created CO2 Pipeline Capital Costs per mile tables for Parker, McCoy, and Rui equations in Pipe Cap plot2 sheet, created table and drop-down boxes for year in Pipe Cap, Pipe Cap plot1, and Pipe Cap plot2 sheets, and created version sheet"]
[2,"Final","2018-02-27","Allison Guinan, Shangmin Lin","Removed multiplier calculations in Cells L81-L95 in Main sheet and very well hid version sheet"]
["2a","Final","2018-03-27","Allison Guinan, Shangmin Lin","Removed \"2\" coefficient from diameter within macro (modNGPipeCapCost) for Parker equation that calculates pipeline capital costs associated with securing right-of-ways"]
["2b","Final","2018-05-01","Allison Guinan, Shangmin Lin","Removed MACRS_GDS_150_20 function from Macro modDepFunc, edited MACRS_GDS_SL_20 function in Macro modDepFunc for 22-year recovery period and with factors from 2017 IRS 946 publication, changed 2014 IRS publication 946 date in MACRS_GDS_150_15 and MACRS_SL_15 introductory paragraphs to 2017 IRS 946 publication date, edited content and equations within tables 2 and 5 in Main sheet based on depreciation changes, changed tax rate in Main sheet to 24%, deleted total pressure change (includes elev.) from Eng Mod sheet (Row 36), added if statements to distance between pumps and pressure drop between pumps so title changes based on number of pumps in Eng Mod sheet, and removed fill and drop down list from units for pressure drop between pumps and added equation linking to units for pressure change in Eng Mod sheet"]
[3,"Intermediate","2020-01-21","Dave Morgan, Allison Guinan, Shangmin Lin","Incorporated ability to calculate costs in real$ and edited financial parameters and project start year within Main sheet and edited electricity cost (Cell D135) and appropriate reference (Cells N135 and C141) in Eng Mod sheet"]
{"$rows_left_out":26}